Discussion:
i586 failed and 86_64 succeeded in Kernel:linux-next > kernel-vanilla build log
(too old to reply)
d***@public.gmane.org
2014-06-24 05:46:12 UTC
Permalink
Raw Message
Hello
I see for kernel-vanilla-3.16.rc1.next
i586 failed
86_64 succeeded

in openSUSE Build Service > Projects > Kernel:linux-next > kernel-vanilla
build log
error listed in log.

Question can it be updated to:linux-3.16-rc2
https://www.kernel.org/pub/linux/kernel/v3.x/testing/linux-3.16-rc2.tar.xz

--Glenn


Build Results Reload
Rpmlint Results

standard
Repository has been published i586
failed
Repository has been published x86_64
[ 5110s] BUILD arch/x86/boot/bzImage
[ 5110s] Setup is 17276 bytes (padded to 17408 bytes).
[ 5110s] System is 4646 kB
[ 5110s] CRC e56e6dcf
[ 5110s] Kernel: arch/x86/boot/bzImage is ready (#1)
[ 5339s] ERROR: "__udivdi3" [drivers/net/wireless/ath/wil6210/wil6210.ko]
undefined!
[ 5342s] make[3]: *** [__modpost] Error 1
[ 5342s] make[2]: *** [modules] Error 2
[ 5342s] make[1]: *** [sub-make] Error 2
[ 5342s] make: *** [__sub-make] Error 2
[ 5342s] + test 2 -eq 0
[ 5342s] + test 01 -gt 0
[ 5342s] + /home/abuild/rpmbuild/SOURCES/try-disable-staging-driver
buildlog
[ 5343s] + exit 1
[ 5343s] error: Bad exit status from /var/tmp/rpm-tmp.TvRhml (%build)
[ 5343s]
[ 5343s]
[ 5343s] RPM build errors:
[ 5343s] Bad exit status from /var/tmp/rpm-tmp.TvRhml (%build)
--
To unsubscribe, e-mail: opensuse-kernel+unsubscribe-***@public.gmane.org
To contact the owner, e-mail: opensuse-kernel+owner-***@public.gmane.org
Larry Finger
2014-06-24 16:59:05 UTC
Permalink
Raw Message
Post by d***@public.gmane.org
Hello
I see for kernel-vanilla-3.16.rc1.next
i586 failed
86_64 succeeded
in openSUSE Build Service > Projects > Kernel:linux-next > kernel-vanilla
build log
error listed in log.
Question can it be updated to:linux-3.16-rc2
https://www.kernel.org/pub/linux/kernel/v3.x/testing/linux-3.16-rc2.tar.xz
--Glenn
Build Results Reload
Rpmlint Results
standard
Repository has been published i586
failed
Repository has been published x86_64
[ 5110s] BUILD arch/x86/boot/bzImage
[ 5110s] Setup is 17276 bytes (padded to 17408 bytes).
[ 5110s] System is 4646 kB
[ 5110s] CRC e56e6dcf
[ 5110s] Kernel: arch/x86/boot/bzImage is ready (#1)
[ 5339s] ERROR: "__udivdi3" [drivers/net/wireless/ath/wil6210/wil6210.ko]
undefined!
[ 5342s] make[3]: *** [__modpost] Error 1
[ 5342s] make[2]: *** [modules] Error 2
[ 5342s] make[1]: *** [sub-make] Error 2
[ 5342s] make: *** [__sub-make] Error 2
[ 5342s] + test 2 -eq 0
[ 5342s] + test 01 -gt 0
[ 5342s] + /home/abuild/rpmbuild/SOURCES/try-disable-staging-driver
buildlog
[ 5343s] + exit 1
[ 5343s] error: Bad exit status from /var/tmp/rpm-tmp.TvRhml (%build)
[ 5343s]
[ 5343s]
[ 5343s] Bad exit status from /var/tmp/rpm-tmp.TvRhml (%build)
I just built 3.16-rc2 for i586 from the wireless-testing and mainline trees, and
the wil6210 driver built just fine. I did not see any commits in the git logs
that say that they fix a missing divide call; however, there are a lot of changes.

Larry
Stefan Seyfried
2014-06-27 19:07:01 UTC
Permalink
Raw Message
Post by d***@public.gmane.org
Hello
I see for kernel-vanilla-3.16.rc1.next
i586 failed
86_64 succeeded
in openSUSE Build Service > Projects > Kernel:linux-next > kernel-vanilla
build log
error listed in log.
Question can it be updated to:linux-3.16-rc2
https://www.kernel.org/pub/linux/kernel/v3.x/testing/linux-3.16-rc2.tar.xz
I don't think you understand what linux-next is.
Hint: It is *not* just the next vanilla kernel.
--
Stefan Seyfried

"For a successful technology, reality must take precedence over
public relations, for nature cannot be fooled." -- Richard Feynman
Loading...